{"text_format":"1","workbook":"xlsx","n_sheets":4,"sheets":["Voting Slate Hide","Voting Slate Highlight","Master","Help"],"not_rendered":{"charts":0,"images":0,"macros":1,"external_links":0,"defined_names":0,"comments":0,"pivot_tables":0},"unopened":[],"bounds":{"document_bytes":16777216,"sheet_cells":100000,"rows_first":2000,"rows_last":500,"rows_between":2000,"halvings":0,"cell_chars":16384,"cell_head_chars":4096},"cells_cut":0,"cells_raw":0,"read":"whole","date_system":"1900"}

{"sheet":"Voting Slate Hide","index":0,"n_rows":101,"n_cols":3,"rows_kept":101,"cut":false,"hidden":false,"merged":[[0,11,1,16],[0,1,1,1]]}
[]
[]
[{"$f":"ROW()-2","v":1},null,{"$f":"VLOOKUP(A3,Master!$A$2:$P$150,16,FALSE)","v":"Ab Stain"}]
[{"$f":"ROW()-2","v":2},null,{"$f":"VLOOKUP(A4,Master!$A$2:$P$150,16,FALSE)","v":"Alco Hauleezoum"}]
[3,null,{"$f":"VLOOKUP(A5,Master!$A$2:$P$150,16,FALSE)","v":"Ano Nimous"}]
[4,null,{"$f":"VLOOKUP(A6,Master!$A$2:$P$150,16,FALSE)","v":"Autaw Nomee"}]
[5,null,{"$f":"VLOOKUP(A7,Master!$A$2:$P$150,16,FALSE)","v":"Awnn Orible"}]
[6,null,{"$f":"VLOOKUP(A8,Master!$A$2:$P$150,16,FALSE)","v":"Charlie Hoors"}]
[7,null,{"$f":"VLOOKUP(A9,Master!$A$2:$P$150,16,FALSE)","v":"Conns Oom"}]
[8,null,{"$f":"VLOOKUP(A10,Master!$A$2:$P$150,16,FALSE)","v":"Dee Vours"}]
[9,null,{"$f":"VLOOKUP(A11,Master!$A$2:$P$150,16,FALSE)","v":"Dem O. Rilizasion"}]
[10,null,{"$f":"VLOOKUP(A12,Master!$A$2:$P$150,16,FALSE)","v":"Dis Tain"}]
[11,null,{"$f":"VLOOKUP(A13,Master!$A$2:$P$150,16,FALSE)","v":"Earra T Bility"}]
[12,null,{"$f":"VLOOKUP(A14,Master!$A$2:$P$150,16,FALSE)","v":"Frank N Stien"}]
[13,null,{"$f":"VLOOKUP(A15,Master!$A$2:$P$150,16,FALSE)","v":"Iamrs Ponsible"}]
[14,null,{"$f":"VLOOKUP(A16,Master!$A$2:$P$150,16,FALSE)","v":"Incommp Rehensible"}]
[15,null,{"$f":"VLOOKUP(A17,Master!$A$2:$P$150,16,FALSE)","v":"Ley Gacie"}]
[16,null,{"$f":"VLOOKUP(A18,Master!$A$2:$P$150,16,FALSE)","v":"Non Shilaunt"}]
[17,null,{"$f":"VLOOKUP(A19,Master!$A$2:$P$150,16,FALSE)","v":"Path'o happee Destonie"}]
[18,null,{"$f":"VLOOKUP(A20,Master!$A$2:$P$150,16,FALSE)","v":"Perso Nalities"}]
[19,null,{"$f":"VLOOKUP(A21,Master!$A$2:$P$150,16,FALSE)","v":"Prince Obles"}]
[20,null,{"$f":"VLOOKUP(A22,Master!$A$2:$P$150,16,FALSE)","v":"Reachout Forhelp"}]
[21,null,{"$f":"VLOOKUP(A23,Master!$A$2:$P$150,16,FALSE)","v":"Recu Vorable"}]
[22,null,{"$f":"VLOOKUP(A24,Master!$A$2:$P$150,16,FALSE)","v":"Seper Ation"}]
[23,null,{"$f":"VLOOKUP(A25,Master!$A$2:$P$150,16,FALSE)","v":"Suss Tae Nobility"}]
[24,null,{"$f":"VLOOKUP(A26,Master!$A$2:$P$150,16,FALSE)","v":"Wirkon Dusteps"}]
[25,null,{"$f":"VLOOKUP(A27,Master!$A$2:$P$150,16,FALSE)","v":"zFirstName25 ZLastName55"}]
[26,null,{"$f":"VLOOKUP(A28,Master!$A$2:$P$150,16,FALSE)","v":"zFirstName26 ZLastName54"}]
[27,null,{"$f":"VLOOKUP(A29,Master!$A$2:$P$150,16,FALSE)","v":"zFirstName27 ZLastName53"}]
[28,null,{"$f":"VLOOKUP(A30,Master!$A$2:$P$150,16,FALSE)","v":"zFirstName28 ZLastName52"}]
[29,null,{"$f":"VLOOKUP(A31,Master!$A$2:$P$150,16,FALSE)","v":"zFirstName29 ZLastName51"}]
[30,null,{"$f":"VLOOKUP(A32,Master!$A$2:$P$150,16,FALSE)","v":"zFirstName30 ZLastName50"}]
[31,null,{"$f":"VLOOKUP(A33,Master!$A$2:$P$150,16,FALSE)","v":"zFirstName31 ZLastName49"}]
[32,null,{"$f":"VLOOKUP(A34,Master!$A$2:$P$150,16,FALSE)","v":"zFirstName32 ZLastName48"}]
[33,null,{"$f":"VLOOKUP(A35,Master!$A$2:$P$150,16,FALSE)","v":"zFirstName33 ZLastName47"}]
[34,null,{"$f":"VLOOKUP(A36,Master!$A$2:$P$150,16,FALSE)","v":"zFirstName34 ZLastName46"}]
[35,null,{"$f":"VLOOKUP(A37,Master!$A$2:$P$150,16,FALSE)","v":"zFirstName35 ZLastName45"}]
[36,null,{"$f":"VLOOKUP(A38,Master!$A$2:$P$150,16,FALSE)","v":"zFirstName36 ZLastName44"}]
[37,null,{"$f":"VLOOKUP(A39,Master!$A$2:$P$150,16,FALSE)","v":"zFirstName37 ZLastName43"}]
[38,null,{"$f":"VLOOKUP(A40,Master!$A$2:$P$150,16,FALSE)","v":"zFirstName38 ZLastName42"}]
[39,null,{"$f":"VLOOKUP(A41,Master!$A$2:$P$150,16,FALSE)","v":"zFirstName39 ZLastName41"}]
[40,null,{"$f":"VLOOKUP(A42,Master!$A$2:$P$150,16,FALSE)","v":"zFirstName40 ZLastName40"}]
[41,null,{"$f":"VLOOKUP(A43,Master!$A$2:$P$150,16,FALSE)","v":""}]
[42,null,{"$f":"VLOOKUP(A44,Master!$A$2:$P$150,16,FALSE)","v":""}]
[43,null,{"$f":"VLOOKUP(A45,Master!$A$2:$P$150,16,FALSE)","v":""}]
[44,null,{"$f":"VLOOKUP(A46,Master!$A$2:$P$150,16,FALSE)","v":""}]
[45,null,{"$f":"VLOOKUP(A47,Master!$A$2:$P$150,16,FALSE)","v":""}]
[46,null,{"$f":"VLOOKUP(A48,Master!$A$2:$P$150,16,FALSE)","v":""}]
[47,null,{"$f":"VLOOKUP(A49,Master!$A$2:$P$150,16,FALSE)","v":""}]
[48,null,{"$f":"VLOOKUP(A50,Master!$A$2:$P$150,16,FALSE)","v":""}]
[49,null,{"$f":"VLOOKUP(A51,Master!$A$2:$P$150,16,FALSE)","v":""}]
[50,null,{"$f":"VLOOKUP(A52,Master!$A$2:$P$150,16,FALSE)","v":""}]
[51,null,{"$f":"VLOOKUP(A53,Master!$A$2:$P$150,16,FALSE)","v":""}]
[52,null,{"$f":"VLOOKUP(A54,Master!$A$2:$P$150,16,FALSE)","v":""}]
[53,null,{"$f":"VLOOKUP(A55,Master!$A$2:$P$150,16,FALSE)","v":""}]
[54,null,{"$f":"VLOOKUP(A56,Master!$A$2:$P$150,16,FALSE)","v":""}]
[55,null,{"$f":"VLOOKUP(A57,Master!$A$2:$P$150,16,FALSE)","v":""}]
[56,null,{"$f":"VLOOKUP(A58,Master!$A$2:$P$150,16,FALSE)","v":""}]
[57,null,{"$f":"VLOOKUP(A59,Master!$A$2:$P$150,16,FALSE)","v":""}]
[58,null,{"$f":"VLOOKUP(A60,Master!$A$2:$P$150,16,FALSE)","v":""}]
[59,null,{"$f":"VLOOKUP(A61,Master!$A$2:$P$150,16,FALSE)","v":""}]
[60,null,{"$f":"VLOOKUP(A62,Master!$A$2:$P$150,16,FALSE)","v":""}]
[61,null,{"$f":"VLOOKUP(A63,Master!$A$2:$P$150,16,FALSE)","v":""}]
[62,null,{"$f":"VLOOKUP(A64,Master!$A$2:$P$150,16,FALSE)","v":""}]
[63,null,{"$f":"VLOOKUP(A65,Master!$A$2:$P$150,16,FALSE)","v":""}]
[64,null,{"$f":"VLOOKUP(A66,Master!$A$2:$P$150,16,FALSE)","v":""}]
[65,null,{"$f":"VLOOKUP(A67,Master!$A$2:$P$150,16,FALSE)","v":""}]
[{"$f":"ROW()-2","v":66},null,{"$f":"VLOOKUP(A68,Master!$A$2:$P$150,16,FALSE)","v":""}]
[67,null,{"$f":"VLOOKUP(A69,Master!$A$2:$P$150,16,FALSE)","v":""}]
[68,null,{"$f":"VLOOKUP(A70,Master!$A$2:$P$150,16,FALSE)","v":""}]
[69,null,{"$f":"VLOOKUP(A71,Master!$A$2:$P$150,16,FALSE)","v":""}]
[70,null,{"$f":"VLOOKUP(A72,Master!$A$2:$P$150,16,FALSE)","v":""}]
[71,null,{"$f":"VLOOKUP(A73,Master!$A$2:$P$150,16,FALSE)","v":""}]
[72,null,{"$f":"VLOOKUP(A74,Master!$A$2:$P$150,16,FALSE)","v":""}]
[73,null,{"$f":"VLOOKUP(A75,Master!$A$2:$P$150,16,FALSE)","v":""}]
[74,null,{"$f":"VLOOKUP(A76,Master!$A$2:$P$150,16,FALSE)","v":""}]
[75,null,{"$f":"VLOOKUP(A77,Master!$A$2:$P$150,16,FALSE)","v":""}]
[76,null,{"$f":"VLOOKUP(A78,Master!$A$2:$P$150,16,FALSE)","v":""}]
[77,null,{"$f":"VLOOKUP(A79,Master!$A$2:$P$150,16,FALSE)","v":""}]
[78,null,{"$f":"VLOOKUP(A80,Master!$A$2:$P$150,16,FALSE)","v":""}]
{"$rows_left_out":22}
{"sheet":"Voting Slate Highlight","index":1,"n_rows":27,"n_cols":21,"rows_kept":27,"cut":false,"hidden":false,"merged":[[0,1,1,1],[0,7,1,7],[0,13,1,20]]}
["Indx",null,16,null,null,null,null,null,null,null,null,null,"Indx"]
[]
[{"$f":"ROW()-2","v":1},null,{"$f":"VLOOKUP(A3,Master!$A$2:$P$150,16)","v":"Ab Stain"},null,null,null,{"$f":"MAX(A:A)+1","v":26},null,{"$f":"VLOOKUP(G3,Master!$A$2:$P$150,16)","v":"zFirstName26 ZLastName54"},null,null,null,{"$f":"MAX(G:G)+1","v":51},null,{"$f":"VLOOKUP(M3,Master!$A$2:$P$150,16)","v":""},null,null,null,{"$f":"MAX(M:M)+1","v":76},null,{"$f":"VLOOKUP(S3,Master!$A$2:$P$150,16)","v":""}]
[{"$f":"ROW()-2","v":2},null,{"$f":"VLOOKUP(A4,Master!$A$2:$P$150,16)","v":"Alco Hauleezoum"},null,null,null,{"$f":"G3+1","v":27},null,{"$f":"VLOOKUP(G4,Master!$A$2:$P$150,16)","v":"zFirstName27 ZLastName53"},null,null,null,{"$f":"M3+1","v":52},null,{"$f":"VLOOKUP(M4,Master!$A$2:$P$150,16)","v":""},null,null,null,{"$f":"S3+1","v":77},null,{"$f":"VLOOKUP(S4,Master!$A$2:$P$150,16)","v":""}]
[3,null,{"$f":"VLOOKUP(A5,Master!$A$2:$P$150,16)","v":"Ano Nimous"},null,null,null,{"$f":"G4+1","v":28},null,{"$f":"VLOOKUP(G5,Master!$A$2:$P$150,16)","v":"zFirstName28 ZLastName52"},null,null,null,{"$f":"M4+1","v":53},null,{"$f":"VLOOKUP(M5,Master!$A$2:$P$150,16)","v":""},null,null,null,{"$f":"S4+1","v":78},null,{"$f":"VLOOKUP(S5,Master!$A$2:$P$150,16)","v":""}]
[4,null,{"$f":"VLOOKUP(A6,Master!$A$2:$P$150,16)","v":"Autaw Nomee"},null,null,null,29,null,{"$f":"VLOOKUP(G6,Master!$A$2:$P$150,16)","v":"zFirstName29 ZLastName51"},null,null,null,54,null,{"$f":"VLOOKUP(M6,Master!$A$2:$P$150,16)","v":""},null,null,null,79,null,{"$f":"VLOOKUP(S6,Master!$A$2:$P$150,16)","v":""}]
[5,null,{"$f":"VLOOKUP(A7,Master!$A$2:$P$150,16)","v":"Awnn Orible"},null,null,null,30,null,{"$f":"VLOOKUP(G7,Master!$A$2:$P$150,16)","v":"zFirstName30 ZLastName50"},null,null,null,55,null,{"$f":"VLOOKUP(M7,Master!$A$2:$P$150,16)","v":""},null,null,null,80,null,{"$f":"VLOOKUP(S7,Master!$A$2:$P$150,16)","v":""}]
[6,null,{"$f":"VLOOKUP(A8,Master!$A$2:$P$150,16)","v":"Charlie Hoors"},null,null,null,31,null,{"$f":"VLOOKUP(G8,Master!$A$2:$P$150,16)","v":"zFirstName31 ZLastName49"},null,null,null,56,null,{"$f":"VLOOKUP(M8,Master!$A$2:$P$150,16)","v":""},null,null,null,81,null,{"$f":"VLOOKUP(S8,Master!$A$2:$P$150,16)","v":""}]
[7,null,{"$f":"VLOOKUP(A9,Master!$A$2:$P$150,16)","v":"Conns Oom"},null,null,null,32,null,{"$f":"VLOOKUP(G9,Master!$A$2:$P$150,16)","v":"zFirstName32 ZLastName48"},null,null,null,57,null,{"$f":"VLOOKUP(M9,Master!$A$2:$P$150,16)","v":""},null,null,null,82,null,{"$f":"VLOOKUP(S9,Master!$A$2:$P$150,16)","v":""}]
[8,null,{"$f":"VLOOKUP(A10,Master!$A$2:$P$150,16)","v":"Dee Vours"},null,null,null,33,null,{"$f":"VLOOKUP(G10,Master!$A$2:$P$150,16)","v":"zFirstName33 ZLastName47"},null,null,null,58,null,{"$f":"VLOOKUP(M10,Master!$A$2:$P$150,16)","v":""},null,null,null,83,null,{"$f":"VLOOKUP(S10,Master!$A$2:$P$150,16)","v":""}]
[9,null,{"$f":"VLOOKUP(A11,Master!$A$2:$P$150,16)","v":"Dem O. Rilizasion"},null,null,null,34,null,{"$f":"VLOOKUP(G11,Master!$A$2:$P$150,16)","v":"zFirstName34 ZLastName46"},null,null,null,59,null,{"$f":"VLOOKUP(M11,Master!$A$2:$P$150,16)","v":""},null,null,null,84,null,{"$f":"VLOOKUP(S11,Master!$A$2:$P$150,16)","v":""}]
[10,null,{"$f":"VLOOKUP(A12,Master!$A$2:$P$150,16)","v":"Dis Tain"},null,null,null,35,null,{"$f":"VLOOKUP(G12,Master!$A$2:$P$150,16)","v":"zFirstName35 ZLastName45"},null,null,null,60,null,{"$f":"VLOOKUP(M12,Master!$A$2:$P$150,16)","v":""},null,null,null,85,null,{"$f":"VLOOKUP(S12,Master!$A$2:$P$150,16)","v":""}]
[11,null,{"$f":"VLOOKUP(A13,Master!$A$2:$P$150,16)","v":"Earra T Bility"},null,null,null,36,null,{"$f":"VLOOKUP(G13,Master!$A$2:$P$150,16)","v":"zFirstName36 ZLastName44"},null,null,null,61,null,{"$f":"VLOOKUP(M13,Master!$A$2:$P$150,16)","v":""},null,null,null,86,null,{"$f":"VLOOKUP(S13,Master!$A$2:$P$150,16)","v":""}]
[12,null,{"$f":"VLOOKUP(A14,Master!$A$2:$P$150,16)","v":"Frank N Stien"},null,null,null,37,null,{"$f":"VLOOKUP(G14,Master!$A$2:$P$150,16)","v":"zFirstName37 ZLastName43"},null,null,null,62,null,{"$f":"VLOOKUP(M14,Master!$A$2:$P$150,16)","v":""},null,null,null,87,null,{"$f":"VLOOKUP(S14,Master!$A$2:$P$150,16)","v":""}]
[13,null,{"$f":"VLOOKUP(A15,Master!$A$2:$P$150,16)","v":"Iamrs Ponsible"},null,null,null,38,null,{"$f":"VLOOKUP(G15,Master!$A$2:$P$150,16)","v":"zFirstName38 ZLastName42"},null,null,null,63,null,{"$f":"VLOOKUP(M15,Master!$A$2:$P$150,16)","v":""},null,null,null,88,null,{"$f":"VLOOKUP(S15,Master!$A$2:$P$150,16)","v":""}]
[14,null,{"$f":"VLOOKUP(A16,Master!$A$2:$P$150,16)","v":"Incommp Rehensible"},null,null,null,39,null,{"$f":"VLOOKUP(G16,Master!$A$2:$P$150,16)","v":"zFirstName39 ZLastName41"},null,null,null,64,null,{"$f":"VLOOKUP(M16,Master!$A$2:$P$150,16)","v":""},null,null,null,89,null,{"$f":"VLOOKUP(S16,Master!$A$2:$P$150,16)","v":""}]
[15,null,{"$f":"VLOOKUP(A17,Master!$A$2:$P$150,16)","v":"Ley Gacie"},null,null,null,40,null,{"$f":"VLOOKUP(G17,Master!$A$2:$P$150,16)","v":"zFirstName40 ZLastName40"},null,null,null,65,null,{"$f":"VLOOKUP(M17,Master!$A$2:$P$150,16)","v":""},null,null,null,90,null,{"$f":"VLOOKUP(S17,Master!$A$2:$P$150,16)","v":""}]
[16,null,{"$f":"VLOOKUP(A18,Master!$A$2:$P$150,16)","v":"Non Shilaunt"},null,null,null,41,null,{"$f":"VLOOKUP(G18,Master!$A$2:$P$150,16)","v":""},null,null,null,66,null,{"$f":"VLOOKUP(M18,Master!$A$2:$P$150,16)","v":""},null,null,null,91,null,{"$f":"VLOOKUP(S18,Master!$A$2:$P$150,16)","v":""}]
[17,null,{"$f":"VLOOKUP(A19,Master!$A$2:$P$150,16)","v":"Path'o happee Destonie"},null,null,null,42,null,{"$f":"VLOOKUP(G19,Master!$A$2:$P$150,16)","v":""},null,null,null,67,null,{"$f":"VLOOKUP(M19,Master!$A$2:$P$150,16)","v":""},null,null,null,92,null,{"$f":"VLOOKUP(S19,Master!$A$2:$P$150,16)","v":""}]
[18,null,{"$f":"VLOOKUP(A20,Master!$A$2:$P$150,16)","v":"Perso Nalities"},null,null,null,43,null,{"$f":"VLOOKUP(G20,Master!$A$2:$P$150,16)","v":""},null,null,null,68,null,{"$f":"VLOOKUP(M20,Master!$A$2:$P$150,16)","v":""},null,null,null,93,null,{"$f":"VLOOKUP(S20,Master!$A$2:$P$150,16)","v":""}]
[19,null,{"$f":"VLOOKUP(A21,Master!$A$2:$P$150,16)","v":"Prince Obles"},null,null,null,44,null,{"$f":"VLOOKUP(G21,Master!$A$2:$P$150,16)","v":""},null,null,null,69,null,{"$f":"VLOOKUP(M21,Master!$A$2:$P$150,16)","v":""},null,null,null,94,null,{"$f":"VLOOKUP(S21,Master!$A$2:$P$150,16)","v":""}]
[20,null,{"$f":"VLOOKUP(A22,Master!$A$2:$P$150,16)","v":"Reachout Forhelp"},null,null,null,45,null,{"$f":"VLOOKUP(G22,Master!$A$2:$P$150,16)","v":""},null,null,null,70,null,{"$f":"VLOOKUP(M22,Master!$A$2:$P$150,16)","v":""},null,null,null,95,null,{"$f":"VLOOKUP(S22,Master!$A$2:$P$150,16)","v":""}]
[21,null,{"$f":"VLOOKUP(A23,Master!$A$2:$P$150,16)","v":"Recu Vorable"},null,null,null,46,null,{"$f":"VLOOKUP(G23,Master!$A$2:$P$150,16)","v":""},null,null,null,71,null,{"$f":"VLOOKUP(M23,Master!$A$2:$P$150,16)","v":""},null,null,null,96,null,{"$f":"VLOOKUP(S23,Master!$A$2:$P$150,16)","v":""}]
[22,null,{"$f":"VLOOKUP(A24,Master!$A$2:$P$150,16)","v":"Seper Ation"},null,null,null,47,null,{"$f":"VLOOKUP(G24,Master!$A$2:$P$150,16)","v":""},null,null,null,72,null,{"$f":"VLOOKUP(M24,Master!$A$2:$P$150,16)","v":""},null,null,null,97,null,{"$f":"VLOOKUP(S24,Master!$A$2:$P$150,16)","v":""}]
[23,null,{"$f":"VLOOKUP(A25,Master!$A$2:$P$150,16)","v":"Suss Tae Nobility"},null,null,null,48,null,{"$f":"VLOOKUP(G25,Master!$A$2:$P$150,16)","v":""},null,null,null,73,null,{"$f":"VLOOKUP(M25,Master!$A$2:$P$150,16)","v":""},null,null,null,98,null,{"$f":"VLOOKUP(S25,Master!$A$2:$P$150,16)","v":""}]
[24,null,{"$f":"VLOOKUP(A26,Master!$A$2:$P$150,16)","v":"Wirkon Dusteps"},null,null,null,49,null,{"$f":"VLOOKUP(G26,Master!$A$2:$P$150,16)","v":""},null,null,null,74,null,{"$f":"VLOOKUP(M26,Master!$A$2:$P$150,16)","v":""},null,null,null,99,null,{"$f":"VLOOKUP(S26,Master!$A$2:$P$150,16)","v":""}]
[25,null,{"$f":"VLOOKUP(A27,Master!$A$2:$P$150,16)","v":"zFirstName25 ZLastName55"},null,null,null,{"$f":"G26+1","v":50},null,{"$f":"VLOOKUP(G27,Master!$A$2:$P$150,16)","v":""},null,null,null,{"$f":"M26+1","v":75},null,{"$f":"VLOOKUP(M27,Master!$A$2:$P$150,16)","v":""},null,null,null,100,null,{"$f":"VLOOKUP(S27,Master!$A$2:$P$150,16)","v":""}]

{"sheet":"Master","index":2,"n_rows":101,"n_cols":16,"rows_kept":101,"cut":false,"hidden":false,"merged":[]}
["Index","First Name","Last Name",null,null,null,null,null,null,null,null,null,null,null,{"$f":"IF(SUM(LEN(B1),LEN(C1))<3,\"\",C1&\", \"&B1)","v":"Last Name, First Name"},{"$f":"IF(SUM(LEN(C1),LEN(B1))<3,\"\",B1&\" \"&C1)","v":"First Name Last Name"}]
[{"$f":"ROW()-1","v":1},"Ab","Stain",null,null,null,null,null,null,null,null,null,null,null,{"$f":"IF(SUM(LEN(B2),LEN(C2))<3,\"\",C2&\", \"&B2)","v":"Stain, Ab"},{"$f":"IF(SUM(LEN(C2),LEN(B2))<3,\"\",B2&\" \"&C2)","v":"Ab Stain"}]
[{"$f":"ROW()-1","v":2},"Alco","Hauleezoum",null,null,null,null,null,null,null,null,null,null,null,"Hauleezoum, Alco",{"$f":"IF(SUM(LEN(C3),LEN(B3))<3,\"\",B3&\" \"&C3)","v":"Alco Hauleezoum"}]
[3,"Ano","Nimous",null,null,null,null,null,null,null,null,null,null,null,{"$f":"IF(SUM(LEN(B4),LEN(C4))<3,\"\",C4&\", \"&B4)","v":"Nimous, Ano"},{"$f":"IF(SUM(LEN(C4),LEN(B4))<3,\"\",B4&\" \"&C4)","v":"Ano Nimous"}]
[4,"Autaw","Nomee",null,null,null,null,null,null,null,null,null,null,null,{"$f":"IF(SUM(LEN(B5),LEN(C5))<3,\"\",C5&\", \"&B5)","v":"Nomee, Autaw"},{"$f":"IF(SUM(LEN(C5),LEN(B5))<3,\"\",B5&\" \"&C5)","v":"Autaw Nomee"}]
[5,"Awnn","Orible",null,null,null,null,null,null,null,null,null,null,null,"Orible, Awnn",{"$f":"IF(SUM(LEN(C6),LEN(B6))<3,\"\",B6&\" \"&C6)","v":"Awnn Orible"}]
[6,"Charlie","Hoors",null,null,null,null,null,null,null,null,null,null,null,"Hoors, Charlie",{"$f":"IF(SUM(LEN(C7),LEN(B7))<3,\"\",B7&\" \"&C7)","v":"Charlie Hoors"}]
[7,"Conns","Oom",null,null,null,null,null,null,null,null,null,null,null,"Oom, Conns",{"$f":"IF(SUM(LEN(C8),LEN(B8))<3,\"\",B8&\" \"&C8)","v":"Conns Oom"}]
[8,"Dee","Vours",null,null,null,null,null,null,null,null,null,null,null,{"$f":"IF(SUM(LEN(B9),LEN(C9))<3,\"\",C9&\", \"&B9)","v":"Vours, Dee"},{"$f":"IF(SUM(LEN(C9),LEN(B9))<3,\"\",B9&\" \"&C9)","v":"Dee Vours"}]
[9,"Dem O.","Rilizasion",null,null,null,null,null,null,null,null,null,null,null,{"$f":"IF(SUM(LEN(B10),LEN(C10))<3,\"\",C10&\", \"&B10)","v":"Rilizasion, Dem O."},{"$f":"IF(SUM(LEN(C10),LEN(B10))<3,\"\",B10&\" \"&C10)","v":"Dem O. Rilizasion"}]
[10,"Dis","Tain",null,null,null,null,null,null,null,null,null,null,null,"Tain, Dis",{"$f":"IF(SUM(LEN(C11),LEN(B11))<3,\"\",B11&\" \"&C11)","v":"Dis Tain"}]
[11,"Earra T","Bility",null,null,null,null,null,null,null,null,null,null,null,"Bility, Earra T",{"$f":"IF(SUM(LEN(C12),LEN(B12))<3,\"\",B12&\" \"&C12)","v":"Earra T Bility"}]
[12,"Frank N","Stien",null,null,null,null,null,null,null,null,null,null,null,"Stien, Frank N",{"$f":"IF(SUM(LEN(C13),LEN(B13))<3,\"\",B13&\" \"&C13)","v":"Frank N Stien"}]
[13,"Iamrs","Ponsible",null,null,null,null,null,null,null,null,null,null,null,"Ponsible, Iamrs",{"$f":"IF(SUM(LEN(C14),LEN(B14))<3,\"\",B14&\" \"&C14)","v":"Iamrs Ponsible"}]
[14,"Incommp","Rehensible",null,null,null,null,null,null,null,null,null,null,null,"Rehensible, Incommp",{"$f":"IF(SUM(LEN(C15),LEN(B15))<3,\"\",B15&\" \"&C15)","v":"Incommp Rehensible"}]
[15,"Ley","Gacie",null,null,null,null,null,null,null,null,null,null,null,"Gacie, Ley",{"$f":"IF(SUM(LEN(C16),LEN(B16))<3,\"\",B16&\" \"&C16)","v":"Ley Gacie"}]
[16,"Non","Shilaunt",null,null,null,null,null,null,null,null,null,null,null,"Shilaunt, Non",{"$f":"IF(SUM(LEN(C17),LEN(B17))<3,\"\",B17&\" \"&C17)","v":"Non Shilaunt"}]
[17,"Path'o happee","Destonie",null,null,null,null,null,null,null,null,null,null,null,"Destonie, Path'o happee",{"$f":"IF(SUM(LEN(C18),LEN(B18))<3,\"\",B18&\" \"&C18)","v":"Path'o happee Destonie"}]
[18,"Perso","Nalities",null,null,null,null,null,null,null,null,null,null,null,"Nalities, Perso",{"$f":"IF(SUM(LEN(C19),LEN(B19))<3,\"\",B19&\" \"&C19)","v":"Perso Nalities"}]
[19,"Prince","Obles",null,null,null,null,null,null,null,null,null,null,null,"Obles, Prince",{"$f":"IF(SUM(LEN(C20),LEN(B20))<3,\"\",B20&\" \"&C20)","v":"Prince Obles"}]
[20,"Reachout","Forhelp",null,null,null,null,null,null,null,null,null,null,null,"Forhelp, Reachout",{"$f":"IF(SUM(LEN(C21),LEN(B21))<3,\"\",B21&\" \"&C21)","v":"Reachout Forhelp"}]
[21,"Recu","Vorable",null,null,null,null,null,null,null,null,null,null,null,"Vorable, Recu",{"$f":"IF(SUM(LEN(C22),LEN(B22))<3,\"\",B22&\" \"&C22)","v":"Recu Vorable"}]
[22,"Seper","Ation",null,null,null,null,null,null,null,null,null,null,null,"Ation, Seper",{"$f":"IF(SUM(LEN(C23),LEN(B23))<3,\"\",B23&\" \"&C23)","v":"Seper Ation"}]
[23,"Suss Tae","Nobility",null,null,null,null,null,null,null,null,null,null,null,"Nobility, Suss Tae",{"$f":"IF(SUM(LEN(C24),LEN(B24))<3,\"\",B24&\" \"&C24)","v":"Suss Tae Nobility"}]
[24,"Wirkon","Dusteps",null,null,null,null,null,null,null,null,null,null,null,"Dusteps, Wirkon",{"$f":"IF(SUM(LEN(C25),LEN(B25))<3,\"\",B25&\" \"&C25)","v":"Wirkon Dusteps"}]
[25,"zFirstName25","ZLastName55",null,null,null,null,null,null,null,null,null,null,null,"ZLastName55, zFirstName25",{"$f":"IF(SUM(LEN(C26),LEN(B26))<3,\"\",B26&\" \"&C26)","v":"zFirstName25 ZLastName55"}]
[26,"zFirstName26","ZLastName54",null,null,null,null,null,null,null,null,null,null,null,"ZLastName54, zFirstName26","zFirstName26 ZLastName54"]
[27,"zFirstName27","ZLastName53",null,null,null,null,null,null,null,null,null,null,null,"ZLastName53, zFirstName27","zFirstName27 ZLastName53"]
[28,"zFirstName28","ZLastName52",null,null,null,null,null,null,null,null,null,null,null,"ZLastName52, zFirstName28","zFirstName28 ZLastName52"]
[29,"zFirstName29","ZLastName51",null,null,null,null,null,null,null,null,null,null,null,"ZLastName51, zFirstName29","zFirstName29 ZLastName51"]
[30,"zFirstName30","ZLastName50",null,null,null,null,null,null,null,null,null,null,null,"ZLastName50, zFirstName30","zFirstName30 ZLastName50"]
[31,"zFirstName31","ZLastName49",null,null,null,null,null,null,null,null,null,null,null,"ZLastName49, zFirstName31","zFirstName31 ZLastName49"]
[32,"zFirstName32","ZLastName48",null,null,null,null,null,null,null,null,null,null,null,"ZLastName48, zFirstName32","zFirstName32 ZLastName48"]
[33,"zFirstName33","ZLastName47",null,null,null,null,null,null,null,null,null,null,null,"ZLastName47, zFirstName33","zFirstName33 ZLastName47"]
[34,"zFirstName34","ZLastName46",null,null,null,null,null,null,null,null,null,null,null,"ZLastName46, zFirstName34","zFirstName34 ZLastName46"]
[35,"zFirstName35","ZLastName45",null,null,null,null,null,null,null,null,null,null,null,"ZLastName45, zFirstName35","zFirstName35 ZLastName45"]
[36,"zFirstName36","ZLastName44",null,null,null,null,null,null,null,null,null,null,null,"ZLastName44, zFirstName36","zFirstName36 ZLastName44"]
[37,"zFirstName37","ZLastName43",null,null,null,null,null,null,null,null,null,null,null,"ZLastName43, zFirstName37","zFirstName37 ZLastName43"]
[38,"zFirstName38","ZLastName42",null,null,null,null,null,null,null,null,null,null,null,"ZLastName42, zFirstName38","zFirstName38 ZLastName42"]
[39,"zFirstName39","ZLastName41",null,null,null,null,null,null,null,null,null,null,null,"ZLastName41, zFirstName39","zFirstName39 ZLastName41"]
[40,"zFirstName40","ZLastName40",null,null,null,null,null,null,null,null,null,null,null,"ZLastName40, zFirstName40","zFirstName40 ZLastName40"]
[41,null,null,null,null,null,null,null,null,null,null,null,null,null,"",""]
[42,null,null,null,null,null,null,null,null,null,null,null,null,null,"",""]
[43,null,null,null,null,null,null,null,null,null,null,null,null,null,"",""]
[44,null,null,null,null,null,null,null,null,null,null,null,null,null,"",""]
[45,null,null,null,null,null,null,null,null,null,null,null,null,null,"",""]
[46,null,null,null,null,null,null,null,null,null,null,null,null,null,"",""]
[47,null,null,null,null,null,null,null,null,null,null,null,null,null,"",""]
[48,null,null,null,null,null,null,null,null,null,null,null,null,null,"",""]
[49,null,null,null,null,null,null,null,null,null,null,null,null,null,"",""]
[50,null,null,null,null,null,null,null,null,null,null,null,null,null,"",""]
[51,null,null,null,null,null,null,null,null,null,null,null,null,null,"",""]
[52,null,null,null,null,null,null,null,null,null,null,null,null,null,"",""]
[53,null,null,null,null,null,null,null,null,null,null,null,null,null,"",""]
[54,null,null,null,null,null,null,null,null,null,null,null,null,null,"",""]
[55,null,null,null,null,null,null,null,null,null,null,null,null,null,"",""]
[56,null,null,null,null,null,null,null,null,null,null,null,null,null,"",""]
[57,null,null,null,null,null,null,null,null,null,null,null,null,null,"",""]
[58,null,null,null,null,null,null,null,null,null,null,null,null,null,"",""]
[59,null,null,null,null,null,null,null,null,null,null,null,null,null,"",""]
[60,null,null,null,null,null,null,null,null,null,null,null,null,null,"",""]
[61,null,null,null,null,null,null,null,null,null,null,null,null,null,"",""]
[62,null,null,null,null,null,null,null,null,null,null,null,null,null,"",""]
[63,null,null,null,null,null,null,null,null,null,null,null,null,null,"",""]
[64,null,null,null,null,null,null,null,null,null,null,null,null,null,"",""]
[65,null,null,null,null,null,null,null,null,null,null,null,null,null,{"$f":"IF(SUM(LEN(B66),LEN(C66))<3,\"\",C66&\", \"&B66)","v":""},{"$f":"IF(SUM(LEN(C66),LEN(B66))<3,\"\",B66&\" \"&C66)","v":""}]
[{"$f":"ROW()-1","v":66},null,null,null,null,null,null,null,null,null,null,null,null,null,"",""]
[67,null,null,null,null,null,null,null,null,null,null,null,null,null,"",""]
[68,null,null,null,null,null,null,null,null,null,null,null,null,null,"",""]
[69,null,null,null,null,null,null,null,null,null,null,null,null,null,"",""]
[70,null,null,null,null,null,null,null,null,null,null,null,null,null,"",""]
[71,null,null,null,null,null,null,null,null,null,null,null,null,null,"",""]
[72,null,null,null,null,null,null,null,null,null,null,null,null,null,"",""]
[73,null,null,null,null,null,null,null,null,null,null,null,null,null,"",""]
[74,null,null,null,null,null,null,null,null,null,null,null,null,null,"",""]
[75,null,null,null,null,null,null,null,null,null,null,null,null,null,"",""]
[76,null,null,null,null,null,null,null,null,null,null,null,null,null,"",""]
[77,null,null,null,null,null,null,null,null,null,null,null,null,null,"",""]
[78,null,null,null,null,null,null,null,null,null,null,null,null,null,"",""]
[79,null,null,null,null,null,null,null,null,null,null,null,null,null,"",""]
{"$rows_left_out":22}
{"sheet":"Help","index":3,"n_rows":0,"n_cols":0,"rows_kept":0,"cut":false,"hidden":false,"merged":[]}